smash-v
type: LexicalEntry
canonical form: smash
sense: 01564190-v
part of speech: verb

01564190-v
type: LexicalConcept
in scheme: en-word.net
definition: collide or strike violently and suddenly
example: The motorcycle smashed into the guard rail
ili: i29537
lexfile: verb.contact
part of speech: verb
hypernym: 01563925-v