segregate-v
type: LexicalEntry
canonical form: segregate
sense: 01561000-v
part of speech: verb

01561000-v
type: LexicalConcept
in scheme: en-word.net
definition: divide from the main body or mass and collect
example: Many towns segregated into new counties
example: Experiments show clearly that genes segregate
ili: i29518
lexfile: verb.contact
part of speech: verb
hypernym: 01560556-v