incise-v
type: LexicalEntry
canonical form: incise
sense: 01558524-v
part of speech: verb

01558524-v
type: LexicalConcept
in scheme: en-word.net
definition: make an incision into by carving or cutting
ili: i29508
lexfile: verb.contact
part of speech: verb
hypernym: 01555301-v