sponge-v
type: LexicalEntry
canonical form: sponge
sense: 01551839-v
part of speech: verb

01551839-v
type: LexicalConcept
in scheme: en-word.net
definition: erase with a sponge; as of words on a blackboard
ili: i29477
lexfile: verb.contact
part of speech: verb
hypernym: 01551500-v