lie-v
type: LexicalEntry
canonical form: lie
sense: 01549783-v
part of speech: verb

01549783-v
type: LexicalConcept
in scheme: en-word.net
definition: be lying, be prostrate; be in a horizontal position
example: The sick man lay in bed all day
example: the books are lying on the shelf
ili: i29466
lexfile: verb.contact
part of speech: verb
entails: 01989043-v
hypernym: 01548665-v
similar: 01989043-v