ramp-v
type: LexicalEntry
canonical form: ramp
sense: 01549295-v
part of speech: verb

01549295-v
type: LexicalConcept
in scheme: en-word.net
definition: stand with arms or forelegs raised, as if menacing
ili: i29463
lexfile: verb.contact
part of speech: verb
hypernym: 01548893-v