decent-a
type: LexicalEntry
canonical form: decent
sense: 01542711-s
part of speech: adjective

01542711-s
type: LexicalConcept
in scheme: en-word.net
definition: sufficiently clothed to see visitors or appear in public
example: are you decent?
ili: i8446
lexfile: adj.all
part of speech: adjective satellite
exemplifies: 07089193-n
similar: https://en-word.net/synset/01541980-a