decent-a
type: LexicalEntry
canonical form: decent
sense: 01542473-s
part of speech: adjective

01542473-s
type: LexicalConcept
in scheme: en-word.net
definition: observing conventional sexual mores in speech or behavior or dress
example: though one of her shoulder straps had slipped down, she was perfectly decent by current standards
ili: i8445
lexfile: adj.all
part of speech: adjective satellite
similar: https://en-word.net/synset/01541980-a