wash-v
type: LexicalEntry
canonical form: wash
sense: 01538034-v
part of speech: verb

launder-v
type: LexicalEntry
canonical form: launder
sense: 01538034-v
part of speech: verb

01538034-v
type: LexicalConcept
in scheme: en-word.net
definition: cleanse with a cleaning agent, such as soap, and water
example: Wash the towels, please!
ili: i29407
lexfile: verb.contact
part of speech: verb
hypernym: 01535377-v
similar: 02748717-v
similar: 01272763-v