clean-v
type: LexicalEntry
canonical form: clean
sense: 01535377-v
part of speech: verb

make clean-v
type: LexicalEntry
canonical form: make clean
sense: 01535377-v
part of speech: verb

01535377-v
type: LexicalConcept
in scheme: en-word.net
definition: make clean by removing dirt, filth, or unwanted substances from
example: Clean the stove!
example: The dentist cleaned my teeth
ili: i29395
lexfile: verb.contact
part of speech: verb
hypernym: 00126072-v
similar: 01536230-v
similar: 02747835-v