silver-a
type: LexicalEntry
canonical form: silver
sense: 01533172-s
part of speech: adjective

01533172-s
type: LexicalConcept
in scheme: en-word.net
definition: made from or largely consisting of silver
example: silver bracelets
ili: i8397
lexfile: adj.all
part of speech: adjective satellite
similar: https://en-word.net/synset/01531539-a