jet-v
type: LexicalEntry
canonical form: jet
sense: 01518922-v
part of speech: verb

gush-v
type: LexicalEntry
canonical form: gush
sense: 01518922-v
part of speech: verb

01518922-v
type: LexicalConcept
in scheme: en-word.net
definition: issue in a jet; come out in a jet; stream or spring forth
example: Water jetted forth
example: flames were jetting out of the building
ili: i29306
lexfile: verb.contact
part of speech: verb
hypernym: 02070867-v