breast-n
type: LexicalEntry
canonical form: breast
sense: 01517072-n
part of speech: noun

01517072-n
type: LexicalConcept
in scheme: en-word.net
definition: the part of an animal's body that corresponds to a person's chest
ili: i43209
lexfile: noun.animal
part of speech: noun
domain topic: 00845915-n
hypernym: 05232383-n