deliver-v
type: LexicalEntry
canonical form: deliver
sense: 01511711-v
part of speech: verb

pitch-v
type: LexicalEntry
canonical form: pitch
sense: 01511711-v
part of speech: verb

01511711-v
type: LexicalConcept
in scheme: en-word.net
definition: throw or hurl from the mound to the batter, as in baseball
example: The pitcher delivered the ball
ili: i29267
lexfile: verb.contact
part of speech: verb
hypernym: 01511000-v