pelt-v
type: LexicalEntry
canonical form: pelt
sense: 01510546-v
part of speech: verb

bombard-v
type: LexicalEntry
canonical form: bombard
sense: 01510546-v
part of speech: verb

01510546-v
type: LexicalConcept
in scheme: en-word.net
definition: cast, hurl, or throw repeatedly with some missile
example: They pelted each other with snowballs
ili: i29262
lexfile: verb.contact
part of speech: verb
hypernym: 01511000-v