broadcast-v
type: LexicalEntry
canonical form: broadcast
sense: 01503823-v
part of speech: verb

01503823-v
type: LexicalConcept
in scheme: en-word.net
definition: sow over a wide area, especially by hand
example: broadcast seeds
ili: i29227
lexfile: verb.contact
part of speech: verb
domain topic: 00918295-n
hypernym: 01503512-v