repose-v
type: LexicalEntry
canonical form: repose
sense: 01500805-v
part of speech: verb

01500805-v
type: LexicalConcept
in scheme: en-word.net
definition: to put something (e.g. trust) in something
example: The nation reposed its confidence in the King
ili: i29209
lexfile: verb.contact
part of speech: verb
hypernym: 01496967-v