put-v
type: LexicalEntry
canonical form: put
sense: 01496398-v
part of speech: verb

01496398-v
type: LexicalConcept
in scheme: en-word.net
definition: cause to be in a certain state; cause to be in a certain relation
example: That song put me in awful good humor
example: put your ideas in writing
ili: i29195
lexfile: verb.contact
part of speech: verb
hypernym: 00126072-v