ripe-a
type: LexicalEntry
canonical form: ripe
sense: 01495405-s
part of speech: adjective

01495405-s
type: LexicalConcept
in scheme: en-word.net
definition: at the highest point of development especially in judgment or knowledge
example: a ripe mind
ili: i8184
lexfile: adj.all
part of speech: adjective satellite
similar: https://en-word.net/synset/01495137-a