veil-v
type: LexicalEntry
canonical form: veil
sense: 01485877-v
part of speech: verb

01485877-v
type: LexicalConcept
in scheme: en-word.net
definition: to obscure, or conceal with or as if with a veil
example: women in Afghanistan veil their faces
ili: i29134
lexfile: verb.contact
part of speech: verb
entails: 01335412-v
hypernym: 02149298-v