concord-v
type: LexicalEntry
canonical form: concord
sense: 01468135-v
part of speech: verb

01468135-v
type: LexicalConcept
in scheme: en-word.net
definition: arrange the words of a text so as to create a concordance
example: The team concorded several thousand nouns, verbs, and adjectives
ili: i29047
lexfile: verb.contact
part of speech: verb
hypernym: 01466592-v