concatenate-v
type: LexicalEntry
canonical form: concatenate
sense: 01467683-v
part of speech: verb

01467683-v
type: LexicalConcept
in scheme: en-word.net
definition: combine two strings to form a single one
ili: i29044
lexfile: verb.contact
part of speech: verb
domain topic: 06138021-n
hypernym: 01467560-v
similar: 00190512-v