neural tube-n
type: LexicalEntry
canonical form: neural tube
sense: 01466574-n
part of speech: noun

01466574-n
type: LexicalConcept
in scheme: en-word.net
definition: a tube of ectodermal tissue in the embryo from which the brain and spinal cord develop
ili: i42998
lexfile: noun.animal
part of speech: noun
hypernym: 01466380-n