winnow-v
type: LexicalEntry
canonical form: winnow
sense: 01463566-v
part of speech: verb

01463566-v
type: LexicalConcept
in scheme: en-word.net
definition: separate the chaff from grain by using air currents
example: She stood there winnowing grain all day in the field
ili: i29028
lexfile: verb.contact
part of speech: verb
hypernym: 01462658-v