hardened-a
type: LexicalEntry
canonical form: hardened
sense: https://en-word.net/lemma/hardened-a#01462080-a
part of speech: adjective

https://en-word.net/synset/01462080-a
type: LexicalConcept
in scheme: en-word.net
definition: protected against attack (especially by nuclear weapons)
example: hardened missile silos
ili: i7985
lexfile: adj.all
part of speech: adjective