bite-v
type: LexicalEntry
canonical form: bite
sense: 01448551-v
part of speech: verb

seize with teeth-v
type: LexicalEntry
canonical form: seize with teeth
sense: 01448551-v
part of speech: verb

01448551-v
type: LexicalConcept
in scheme: en-word.net
definition: to grip, cut off, or tear with or as if with the teeth or jaws
example: Gunny invariably tried to bite her
ili: i28957
lexfile: verb.contact
part of speech: verb
hypernym: 01226565-v