bore-v
type: LexicalEntry
canonical form: bore
sense: 01445640-v
part of speech: verb

drill-v
type: LexicalEntry
canonical form: drill
sense: 01445640-v
part of speech: verb

01445640-v
type: LexicalConcept
in scheme: en-word.net
definition: make a hole, especially with a pointed power or hand tool
example: don't drill here, there's a gas pipe
example: drill a hole into the wall
example: drill for oil
example: carpenter bees are boring holes into the wall
ili: i28941
lexfile: verb.contact
part of speech: verb
hypernym: 01559703-v