roach-n
type: LexicalEntry
canonical form: roach
sense: 01445091-n
part of speech: noun

Rutilus rutilus-n
type: LexicalEntry
canonical form: Rutilus rutilus
sense: 01445091-n
part of speech: noun

01445091-n
type: LexicalConcept
in scheme: en-word.net
definition: European freshwater food fish having a greenish back
ili: i42872
lexfile: noun.animal
part of speech: noun
hypernym: 01441762-n