pierce-v
type: LexicalEntry
canonical form: pierce
sense: 01444129-v
part of speech: verb

thrust-v
type: LexicalEntry
canonical form: thrust
sense: 01444129-v
part of speech: verb

01444129-v
type: LexicalConcept
in scheme: en-word.net
definition: penetrate or cut through with a sharp instrument
ili: i28934
lexfile: verb.contact
part of speech: verb
hypernym: 01230239-v