prickle-v
type: LexicalEntry
canonical form: prickle
sense: 01443420-v
part of speech: verb

prick-v
type: LexicalEntry
canonical form: prick
sense: 01443420-v
part of speech: verb

01443420-v
type: LexicalConcept
in scheme: en-word.net
definition: make a small hole into, as with a needle or a thorn
example: The nurse pricked my finger to get a small blood sample
ili: i28931
lexfile: verb.contact
part of speech: verb
hypernym: 01443719-v