project-v
type: LexicalEntry
canonical form: project
sense: 01438648-v
part of speech: verb

01438648-v
type: LexicalConcept
in scheme: en-word.net
definition: transfer (ideas or principles) from one domain into another
ili: i28906
lexfile: verb.contact
part of speech: verb
hypernym: 01438013-v