breed-v
type: LexicalEntry
canonical form: breed
sense: 01433080-v
part of speech: verb

cover-v
type: LexicalEntry
canonical form: cover
sense: 01433080-v
part of speech: verb

01433080-v
type: LexicalConcept
in scheme: en-word.net
definition: copulate with a female, used especially of horses
example: The horse covers the mare
ili: i28880
lexfile: verb.contact
part of speech: verb
domain topic: 00919042-n
hypernym: 01431486-v
similar: 00059956-v