churn-v
type: LexicalEntry
canonical form: churn
sense: 01421043-v
part of speech: verb

01421043-v
type: LexicalConcept
in scheme: en-word.net
definition: stir (cream) vigorously in order to make butter
ili: i28821
lexfile: verb.contact
part of speech: verb
domain topic: 00244785-n
hypernym: 01898313-v