sea tangle-n
type: LexicalEntry
canonical form: sea tangle
sense: 01406236-n
part of speech: noun

tang-n
type: LexicalEntry
canonical form: tang
sense: 01406236-n
part of speech: noun

01406236-n
type: LexicalConcept
in scheme: en-word.net
definition: any of various kelps especially of the genus Laminaria
ili: i42700
lexfile: noun.animal
part of speech: noun
hypernym: 01406098-n