crack-v
type: LexicalEntry
canonical form: crack
sense: 01404609-v
part of speech: verb

01404609-v
type: LexicalConcept
in scheme: en-word.net
definition: hit forcefully; deal a hard blow, making a cracking noise
example: The teacher cracked him across the face with a ruler
ili: i28731
lexfile: verb.contact
part of speech: verb
hypernym: 01402698-v