beat-v
type: LexicalEntry
canonical form: beat
sense: 01402230-v
part of speech: verb

01402230-v
type: LexicalConcept
in scheme: en-word.net
definition: strike (a part of one's own body) repeatedly, as in great emotion or in accompaniment to music
example: beat one's breast
example: beat one's foot rhythmically
ili: i28720
lexfile: verb.contact
part of speech: verb
hypernym: 01412877-v
similar: 01401573-v