gentle-a
type: LexicalEntry
canonical form: gentle
sense: 01376241-s
part of speech: adjective

01376241-s
type: LexicalConcept
in scheme: en-word.net
definition: having or showing a kindly or tender nature
example: the gentle touch of her hand
example: her gentle manner was comforting
example: a gentle sensitive nature
example: gentle blue eyes
ili: i7481
lexfile: adj.all
part of speech: adjective satellite
similar: https://en-word.net/synset/01374976-a