benignant-a
type: LexicalEntry
canonical form: benignant
sense: 01375495-s
part of speech: adjective

gracious-a
type: LexicalEntry
canonical form: gracious
sense: 01375495-s
part of speech: adjective

01375495-s
type: LexicalConcept
in scheme: en-word.net
definition: characterized by kindness and warm courtesy especially of a king to his subjects
example: our benignant king
ili: i7478
lexfile: adj.all
part of speech: adjective satellite
similar: https://en-word.net/synset/01374976-a