plant-v
type: LexicalEntry
canonical form: plant
sense: 01373866-v
part of speech: verb

01373866-v
type: LexicalConcept
in scheme: en-word.net
definition: place something or someone in a certain position in order to secretly observe or deceive
example: Plant a spy in Moscow
example: plant bugs in the dissident's apartment
ili: i28564
lexfile: verb.contact
part of speech: verb
hypernym: 01496967-v