confine-v
type: LexicalEntry
canonical form: confine
sense: 01349980-v
part of speech: verb

01349980-v
type: LexicalConcept
in scheme: en-word.net
definition: prevent from leaving or from being removed
ili: i28429
lexfile: verb.contact
part of speech: verb
hypernym: 00233707-v