close-v
type: LexicalEntry
canonical form: close
sense: 01347791-v
part of speech: verb

shut-v
type: LexicalEntry
canonical form: shut
sense: 01347791-v
part of speech: verb

01347791-v
type: LexicalConcept
in scheme: en-word.net
definition: move so that an opening or passage is obstructed; make shut
example: Close the door
example: shut the window
ili: i28418
lexfile: verb.contact
part of speech: verb
causes: 01349660-v
hypernym: 01854282-v
similar: 01349660-v