baste-v
type: LexicalEntry
canonical form: baste
sense: 01334030-v
part of speech: verb

tack-v
type: LexicalEntry
canonical form: tack
sense: 01334030-v
part of speech: verb

01334030-v
type: LexicalConcept
in scheme: en-word.net
definition: sew together loosely, with large stitches
example: baste a hem
ili: i28344
lexfile: verb.contact
part of speech: verb
hypernym: 01331921-v