butcher-v
type: LexicalEntry
canonical form: butcher
sense: 01325518-v
part of speech: verb

slaughter-v
type: LexicalEntry
canonical form: slaughter
sense: 01325518-v
part of speech: verb

01325518-v
type: LexicalConcept
in scheme: en-word.net
definition: kill (animals) usually for food consumption
example: They slaughtered their only goat to survive the winter
ili: i28301
lexfile: verb.contact
part of speech: verb
entails: 01555301-v
hypernym: 01326622-v