rifle-v
type: LexicalEntry
canonical form: rifle
sense: 01321509-v
part of speech: verb

go-v
type: LexicalEntry
canonical form: go
sense: 01321509-v
part of speech: verb

01321509-v
type: LexicalConcept
in scheme: en-word.net
definition: go through in search of something; search through someone's belongings in an unauthorized way
example: Who rifled through my desk drawers?
ili: i28278
lexfile: verb.contact
part of speech: verb
hypernym: 01320383-v