want-v
type: LexicalEntry
canonical form: want
sense: 01319724-v
part of speech: verb

01319724-v
type: LexicalConcept
in scheme: en-word.net
definition: hunt or look for; want for a particular reason
example: Your former neighbor is wanted by the FBI
example: Uncle Sam wants you
ili: i28269
lexfile: verb.contact
part of speech: verb
hypernym: 01318273-v
similar: 00711034-v