dowse-v
type: LexicalEntry
canonical form: dowse
sense: 01317800-v
part of speech: verb

01317800-v
type: LexicalConcept
in scheme: en-word.net
definition: use a divining rod in search of underground water or metal
ili: i28261
lexfile: verb.contact
part of speech: verb
hypernym: 01317608-v