innocent-a
type: LexicalEntry
canonical form: innocent
sense: 01312175-s
part of speech: adjective

unacquainted-a
type: LexicalEntry
canonical form: unacquainted
sense: 01312175-s
part of speech: adjective

01312175-s
type: LexicalConcept
in scheme: en-word.net
definition: not knowledgeable about something specified
example: American tourists wholly innocent of French
example: a person unacquainted with our customs
ili: i7132
lexfile: adj.all
part of speech: adjective satellite
similar: https://en-word.net/synset/01311380-a