bind-v
type: LexicalEntry
canonical form: bind
sense: 01305902-v
part of speech: verb

01305902-v
type: LexicalConcept
in scheme: en-word.net
definition: make fast; tie or secure, with or as if with a rope
example: The Chinese would bind the feet of their women
ili: i28194
lexfile: verb.contact
part of speech: verb
hypernym: 01299048-v