severe-a
type: LexicalEntry
canonical form: severe
sense: 01304251-s
part of speech: adjective

spartan-a
type: LexicalEntry
canonical form: spartan
sense: 01304251-s
part of speech: adjective

01304251-s
type: LexicalConcept
in scheme: en-word.net
definition: unsparing and uncompromising in discipline or judgment
example: a parent severe to the pitch of hostility
  source: H.G.Wells
example: a hefty six-footer with a rather severe mien
example: a strict disciplinarian
example: a Spartan upbringing
ili: i7090
lexfile: adj.all
part of speech: adjective satellite
similar: https://en-word.net/synset/01302836-a