broad-a
type: LexicalEntry
canonical form: broad
sense: 01290162-s
part of speech: adjective

01290162-s
type: LexicalConcept
in scheme: en-word.net
definition: (of speech) heavily and noticeably regional
example: a broad southern accent
ili: i7015
lexfile: adj.all
part of speech: adjective satellite
similar: https://en-word.net/synset/01289803-a